{"text_format":"1","workbook":"xlsx","n_sheets":14,"sheets":["Cover","1-Title","2-Contents","3-Background","4-Instructions","5-Facility Inputs","6-Waste Inputs","7-Economic Inputs","8-Default Values","9-Outputs","10-Wet AD","11-Dry AD","12-Tool Assumptions","13-Sources"],"not_rendered":{"charts":4,"images":1,"macros":1,"external_links":1,"defined_names":108,"comments":0,"pivot_tables":0},"unopened":[],"bounds":{"document_bytes":16777216,"sheet_cells":100000,"rows_first":2000,"rows_last":500,"rows_between":2000,"halvings":0,"cell_chars":16384,"cell_head_chars":4096},"cells_cut":0,"cells_raw":0,"read":"whole","date_system":"1900"}

{"sheet":"Cover","index":0,"n_rows":0,"n_cols":0,"rows_kept":0,"cut":false,"hidden":false,"merged":[]}

{"sheet":"1-Title","index":1,"n_rows":7,"n_cols":3,"rows_kept":7,"cut":false,"hidden":false,"merged":[]}
[]
[null,"Title"]
[]
[null,"Title","OrganEcs – Cost Estimating Tool for Anaerobic Digestion"]
[null,"Version","3 (Anerobic Digestion Edition)"]
[null,"Acknowledgements","OrganEcs, was developed by the U.S. Environmental Protection Agency under the auspices of the Global Methane Initiative and in support of the Climate and Clean Air Coalition.. Tom Frankiewicz (EPA’s International Biogas Team Lead) managed the tool’s development with technical support from Abt Associates.\n\nThe U.S. EPA recommends users cite OrganEcs with the following citation when citing the tool in published work: \nU.S. EPA. 2021. OrganEcs-Anaerobic Digestion V3.0. "]
[null,"Disclaimer","The tool is meant to provide planning-level assistance, outputs should be verified through a detailed feasibility study (or through the solicitation of bids from qualified proposers) before project development commences."]

{"sheet":"2-Contents","index":2,"n_rows":16,"n_cols":4,"rows_kept":16,"cut":false,"hidden":false,"merged":[]}
[]
[null,"Contents"]
[]
[null,1,null,"Title"]
[null,{"$f":"B4+1","v":2},null,"Contents"]
[null,{"$f":"B5+1","v":3},null,"Background"]
[null,4,null,"Instructions"]
[null,5,null,"Facility Inputs"]
[null,6,null,"Waste Inputs"]
[null,7,null,"Economic Inputs"]
[null,8,null,"Default Values"]
[null,9,null,"Outputs"]
[null,10,null,"Wet Anaerobic Digestion"]
[null,11,null,"Dry Anaerobic Digestion"]
[null,12,null,"Tool Assumptions"]
{"$rows_left_out":2}
{"sheet":"3-Background","index":3,"n_rows":4,"n_cols":4,"rows_kept":4,"cut":false,"hidden":false,"merged":[[3,1,3,2]]}
[]
[null,"Background"]
[]
[null,"Introduction ",null,"The Global Methane Initiative works with cities worldwide to improve solid waste management and reduce emissions of short-lived climate pollutants. OrganEcs was developed by the U.S. Environmental Protection Agency under the auspices of the Global Methane Initiative and in support of the Climate and Clean Air Coalition. Organic waste management projects (i.e., composting, and anaerobic digestion) represent a key opportunity for achieving these objectives. Planning and development of such projects require a detailed understanding of the costs involved in construction and operation of organic waste management facilities.\n\nOrganEcs is a tool for estimating the costs associated with organic waste management projects. It provides planning-level assistance to local governments, waste professionals, policymakers, facility operators, and project developers to help them make financial decisions about their potential organic projects. Specifically, the tool assists users in determining the expected IRR (internal rate of return), given user inputs for an anerobic digestion project. \n\nModel outputs should be viewed as preliminary results that can be used for planning purposes. These estimates should be verified through detailed feasibility studies prior to project development, or through the solicitation of bids from qualified firms. "]

{"sheet":"4-Instructions","index":4,"n_rows":16,"n_cols":3,"rows_kept":16,"cut":false,"hidden":false,"merged":[[14,1,14,3],[15,1,15,3],[9,2,9,3],[1,1,1,3],[12,1,12,3],[13,1,13,3],[10,1,10,3],[11,1,11,3],[3,1,3,3],[4,1,4,3],[6,2,6,3],[7,2,7,3],[8,2,8,3],[5,1,5,3]]}
[]
[null,"Instructions"]
[]
[null,"Model Organization"]
[null,"This tool has 13 sheets, and the tabs are color coded as follows: \n  •  BLUE tabs: User inputs.\n  •  YELLOW tab: Default values.\n  •  BLACK tab: Results or Outputs.\n  •  GRAY tabs: Organic waste treatment technologies\n  •  GREEN tabs: Assumptions and additional resources. "]
[null,"Operating the Tool"]
[null,"Version Control","•  Please ensure that you have downloaded the latest version of OrganEcs from the Global Methane Initiative.\n•  Ensure you save the file as “Type: Excel Macro-Enabled Workbook.”\n•  Please do not use a version that was previously used, or has data, for any other city."]
[null,"Macros","•  You must ENABLE the macros by clicking the \"Enable Content\" button next to the warning message at the top of the spreadsheet."]
[null,"Cell Colors","•  Input cells are BLUE and will change to a lighter shade once you enter data. \n•  Default cells are YELLOW and will change to brown if they are altered.\n•  Some cells have an automatic validity check. If you enter an incorrect value or make an invalid selection, the cell will turn RED, and an error message will appear. Please correct the error before continuing."]
[null,"Data Entry","•  Enter all required user inputs into the blue cells in the input tabs (“5-Facility Inputs,” “6-Waste Inputs,” and “7-Economic Inputs”). Please fill in all blue tabs in order to receive accurate outputs.\n•  Review the default values on tab \"8-Default Values\" and alter if desired.\n•  Additional instructions and source references can be found at the top of each tab and in the notes attached to the relevant input cells. "]
[null,"Help"]
[null,"If you need assistance while using the model, please send any questions to BiogasTools@abtassoc.com."]
[null,"Tool Limitations"]
[null,"(1) Cost estimates are for source-separated organic feedstocks and do not include pre-sorting costs or revenues associated with an upstream materials recovery facility. Additional costs associated with establishing source-separated collection are not considered.\n\n(2) Facility performance (e.g., electricity and compost production, water demand, wastewater generation, equipment lifespan, operating days/year) is based on published data for typical facilities and will vary based on a number of factors, including, but not limited to, operating and maintenance (O&M) practices, feedstock characteristics, selected technology, and climate.\n\n(3) The tool requires a minimum waste throughput of 5,000 TPY to 20,000 TPY for AD, and thus is not suitable for modeling small, decentralized projects.\n\n(4) Tool construction requires that equity be provided to the project. Minimum values must be entered for Internal Rate of Return (IRR), Equity Payback, and % Equity on the \"7-Economic Inputs\" tab in order for the tool to return values. Minimum value requirements are located in notes attached to the relevant cells."]
[null,"Tool Assumptions"]
{"$rows_left_out":2}
{"sheet":"5-Facility Inputs","index":5,"n_rows":177,"n_cols":80,"rows_kept":177,"cut":false,"hidden":false,"merged":[[3,1,4,1],[3,2,4,3],[7,1,7,2],[10,1,10,2]]}
[]
[null,"Facility Inputs - Design Parameters for New Facility"]
[]
[null,"Instructions: ","Make sure you ENABLE macros by pressing the \"Enable Content\" button next to the warning message at the top of the spreadsheet; you may also have been asked to enable macros through a warning message upon opening the model. If you forgot to enable macros, please close and reopen the tool. Choose which technologies you are interested in developing and/or comparing in rows 9 and 10. Enter design parameters into the blue cells, or select values from the drop-down menus, only for facility(ies) to be developed or compared. Cell color will change to a lighter shade of blue once you enter data. You may alter current default values (yellow cells), if necessary. Cell color will change to brown if altered."]
[]
[]
[null,"Technology Selection"]
[null,"Please choose \"Yes\" in the dropdown list for the technologies you are interested in developing/ comparing. If you are not interested in the technology, please choose \"No.\""]
[null,"Wet Anaerobic Digestion","CHOOSE ONE"]
[null,"Dry Anaerobic Digestion","CHOOSE ONE"]
[null,{"$f":"IF(AND(C9<>\"Yes\",C10<>\"Yes\",E9<>\"Yes\",E10<>\"Yes\"),\"ERROR - Please choose 'Yes' for at least one technology.\", \"\")","v":"ERROR - Please choose 'Yes' for at least one technology."}]
[]
[null,"Facility Operations",null,null,null,"Units"]
[null,"Investment Year"]
[null,"Construction Period",null,null,null,"Years"]
{"$rows_left_out":163}
{"sheet":"6-Waste Inputs","index":6,"n_rows":69,"n_cols":86,"rows_kept":69,"cut":false,"hidden":false,"merged":[[68,2,68,6],[53,2,53,3],[3,3,8,7],[3,2,8,2],[39,2,39,5],[37,2,37,3],[15,2,15,10],[16,2,16,10],[17,4,17,10]]}
[]
[null,null,"Waste Inputs - Feedstock Characteristics"]
[]
[null,null,"Instructions: ","- User should enter tonnes/year of available feedstock in the first table (\"ALL SCENARIOS\") and the projected growth rate of waste in the  \"Total Incoming Feedstock\" table, regardless of which technology user intends to pursue. Feedstock characteristics will vary by location and season.  \n- Input cells will change to light blue once user has entered local data. \n- User may choose to use default feedstock characteristics or enter data from laboratory analysis into the yellow-green cells. \n- Default cells will change to dark brown if value is altered. \n- Based on feedstock blending calculations, user should modify the amount of purchased bulking agent required to meet the target values in red, which are unique to each type of technology. If target values are not met, cell will be highlighted in red."]
[]
[]
[]
[]
[]
[]
[]
[]
[]
[null,null,null,null,null,null,null,"Purchased Bulking Agent for Compost  (e.g., Woo+H14d Chips) "]
[]
{"$rows_left_out":55}
{"sheet":"7-Economic Inputs","index":7,"n_rows":496,"n_cols":79,"rows_kept":496,"cut":false,"hidden":false,"merged":[[3,2,5,6],[3,1,5,1],[14,1,14,4],[14,7,14,10]]}
[]
[null,"Economic Inputs - Costs, Revenues, & Financial Parameters"]
[]
[null,"Instructions: "]
[]
[]
[]
[]
[]
[]
[]
[]
[]
[]
[null,"PROJECT COSTS",null,null,null,"Units",null,"PROJECT REVENUES",null,null,null,"Units"]
{"$rows_left_out":482}
{"sheet":"8-Default Values","index":8,"n_rows":128,"n_cols":80,"rows_kept":128,"cut":false,"hidden":false,"merged":[[3,1,4,1],[3,2,4,5]]}
[]
[null,"Default Values"]
[]
[null,"Instructions:"]
[]
[]
[]
[]
[]
[null,"Technology","Wet AD","Dry AD"]
[null,"Total Annual Waste to AD in YR 1 of Operations",{"$f":"'10-Wet AD'!D20","v":0},{"$f":"'11-Dry AD'!D21","v":0}]
[null,"Facility Design Capacity",{"$f":"IF(C11=0,0,SUM(FoodWasteTonnes:CardboardTonnes)*(1+WasteGrowthRate))","v":0},{"$f":"IF(D11=0,0,SUM(YardWasteTonnes:CardboardTonnes)*(1+WasteGrowthRate))","v":0}]
[]
[null,"Scenario"]
[null,"Facility Operations",5.0000000000000002E-5]
{"$rows_left_out":114}
{"sheet":"9-Outputs","index":9,"n_rows":545,"n_cols":8,"rows_kept":545,"cut":false,"hidden":false,"merged":[[3,1,4,1],[3,2,4,4]]}
[]
[null,"Outputs"]
[]
[null,"Instructions: ","This sheet summarizes and visualizes some basic information about the project based on user inputs from tab “5-Faculty Inputs,” “6-Waste Inputs,” “7-Economic Inputs,” and “8-Default Values.” "]
[]
[]
[]
[null,"Wet Anaerobic Digestion",null,"USD",null,"Dry Anaerobic Digestion",null,"USD"]
[null,"Initial Capital Investment - AD ($)",null,{"$f":"IF(ISERROR(ROUNDUP('10-Wet AD'!D42,-2)),0,(ROUNDUP('10-Wet AD'!D42,-2)))","v":0},null,"Initial Capital Investment - AD ($)",null,{"$f":"IF(ISERROR(ROUNDUP('11-Dry AD'!D42,-2)),0,(ROUNDUP('11-Dry AD'!D42,-2)))","v":0}]
[null,"Capex/tonne ($/TPY)",null,{"$f":"IF(ISERROR(ROUNDUP(D9/D15,0)),0,ROUNDUP(D9/D15,0))","v":0},null,"Capex/tonne ($/TPY)",null,{"$f":"IF(ISERROR(ROUNDUP(H9/H15,0)),0,(ROUNDUP(H9/H15,0)))","v":0}]
[null,"Total Annual Expenses in YR 1 Operations ($/year)",null,{"$f":"IF(ISERROR(ROUNDUP(MIN('10-Wet AD'!D207:Z207),-2)),0,(ROUNDUP(MIN('10-Wet AD'!D207:Z207),-2)))","v":0},null,"Total Annual Expenses in YR 1 Operations ($/year)",null,{"$f":"IF(ISERROR(ROUNDUP(MIN('11-Dry AD'!D197:Z197),-2)),0,(ROUNDUP(MIN('11-Dry AD'!D197:Z197),-2)))","v":0}]
[null,"O&M/tonne in YR 1 Operations ($/tonne of waste processed)",null,{"$f":"IF(ISERROR(ROUNDUP(D11/(D14),0)),0,ROUNDUP(D11/(D14),0))","v":0},null,"O&M/tonne in YR 1 Operations ($/tonne of waste processed)",null,{"$f":"IF(ISERROR(ROUNDUP(H11/(H14),0)),0,(ROUNDUP(H11/(H14),0)))","v":0}]
[null,"Total Land Required (ha)",null,{"$f":"'10-Wet AD'!$D$24","v":0},null,"Total Land Required (ha)",null,{"$f":"'11-Dry AD'!D25","v":0}]
[null,"Total Organic Waste Available In YR 1 (tonnes/year)",null,{"$f":"FeedstockAvailability","v":0},null,"Total Organic Waste Available in YR 1 (tonnes/year)",null,{"$f":"FeedstockAvailability","v":0}]
[null,"Total Waste to AD in YR 1 (tonnes/year)",null,{"$f":"'10-Wet AD'!D20","v":0},null,"Total Waste to AD in YR 1 (tonnes/year)",null,{"$f":"'11-Dry AD'!D21","v":0}]
{"$rows_left_out":531}
{"sheet":"10-Wet AD","index":10,"n_rows":207,"n_cols":26,"rows_kept":207,"cut":false,"hidden":false,"merged":[[3,1,4,1],[3,2,4,4],[52,3,52,4],[53,1,53,4]]}
[]
[null,"Wet Anaerobic Digestion"]
[]
[null,"Guidance: ","This sheet shows the hypothetical project’s estimated annual Income Statement and Balance Sheet, which are used to determine the Internal Rate of Return (IRR). The IRR is the rate that the modeled project’s cash flows break even with initial investment. IRR is determined by setting the net present value of all cash flows (both positive and negative) from the investment equal to zero. Note this model estimates Equity IRR. To estimate Project IRR, please set total debt on the “7-Economic Inputs” tab equal to zero. To find the assumed differences between high and low CAPEX, look on the “8-Default Values” tab. Interpret these values as a range in which the hypothetical project may fall in-between. \n\nThe sheet is organized by first listing important assumptions based on user inputs from tabs “5-Faculty Inputs,” “6-Waste Inputs,” “7-Economic Inputs,” and “8-Default Values.” Below this are estimated project costs and revenues, debt schedules, interest, depreciation, and other important information. Lastly, the model estimates the free cash flow in a given year based on the project costs and revenues to estimate IRR (cell D315). "]
[]
[]
[null,"Key Prices"]
[null,"Electricity Sale Price",null,{"$f":"WholesaleElectricitySalePrice","v":0},"$/kWh"]
[null,"Gate Fee - Yard Wastes",null,{"$f":"GateFeeYardWaste","v":0},"$/tonne"]
[null,"Gate Fee - Food Wastes",null,{"$f":"GateFeeFoodWaste","v":0},"$/tonne"]
[null,"Gate Fee - Manure/Sludge Waste",null,{"$f":"GateFeeManure","v":0},"$/tonne"]
[null,"Gate Fee - Paper/Cardboard",null,{"$f":"GateFeeOther","v":0},"$/tonne"]
[]
[null,"AD Facility Assumptions",null,null,"Units"]
[null,"Equipment Lifespan",null,{"$f":"DepreciationADandAllInfrastructure","v":20},"years"]
{"$rows_left_out":193}
{"sheet":"11-Dry AD","index":11,"n_rows":197,"n_cols":26,"rows_kept":197,"cut":false,"hidden":false,"merged":[[3,1,4,1],[3,2,4,4],[52,3,52,4],[53,1,53,4]]}
[]
[null,"Dry Anaerobic Digestion"]
[]
[null,"Guidance: ","This sheet shows the hypothetical project’s estimated annual Income Statement and Balance Sheet, which are used to determine the Internal Rate of Return (IRR). The IRR is the rate that the modeled project’s cash flows break even with initial investment. IRR is determined by setting the net present value of all cash flows (both positive and negative) from the investment equal to zero. Note this model estimates Equity IRR. To estimate Project IRR, please set total debt on the “7-Economic Inputs” tab equal to zero. To find the assumed differences between high and low CAPEX, look on the “8-Default Values” tab. Interpret these values as a range in which the hypothetical project may fall in-between. \n\nThe sheet is organized by first listing important assumptions based on user inputs from tabs “5-Faculty Inputs,” “6-Waste Inputs,” “7-Economic Inputs,” and “8-Default Values.” Below this are estimated project costs and revenues, debt schedules, interest, depreciation, and other important information. Lastly, the model estimates the free cash flow in a given year based on the project costs and revenues to estimate IRR (cell D299)."]
[]
[]
[null,"Key Outputs"]
[null,"Electricity Sale Price",null,{"$f":"WholesaleElectricitySalePrice","v":0},"$/kWh"]
[null,"Gate Fee - Yard Waste",null,{"$f":"GateFeeYardWaste","v":0},"$/tonne"]
[null,"Gate Fee - Food Waste",null,{"$f":"GateFeeFoodWaste","v":0},"$/tonne"]
[null,"Gate Fee - Manure/Sludge Waste",null,{"$f":"GateFeeManure","v":0},"$/tonne"]
[null,"Gate Fee - Other Waste",null,{"$f":"GateFeeOther","v":0},"$/tonne"]
[]
[null,"AD Facility Assumptions",null,null,"Units"]
[null,"Equipment Lifespan",null,{"$f":"DepreciationADandAllInfrastructure","v":20},"years"]
{"$rows_left_out":183}
{"sheet":"12-Tool Assumptions","index":12,"n_rows":20,"n_cols":6,"rows_kept":20,"cut":false,"hidden":false,"merged":[[3,1,4,1],[3,3,4,3]]}
[]
[null,"Tool Assumptions"]
[]
[null,"Guidance: ",null,"This tab provides a list of additional assumptions used throughout the model, and their sources."]
[]
[]
[null,null,null,"Assumption",null,"Source"]
[null,1,null,"Revenues and expenses are projected over the same 20-year operating period for all technologies. The tool can tolerate construction periods greater than 1 and less than 3 years. "]
[null,2,null,"AD scenarios produce electricity and heat with a CHP system. Alternative energy/fuel products such as heat and transportation fuels are also proven outputs but are not considered a part of this tool."]
[null,3,null,"When electing to purchase land, it is assumed that the land is financed along with the facility, but is sold at the end of the project life. The value of the land is inflated at the general rate of inflation."]
[null,4,null,"Short-term debt is used to finance the purchase of composting equipment. Long-term debt is used to finance composting and AD site development and infrastructure costs, land purchases, and AD equipment costs. When the debt tenor specified by the user exceeds the remaining life of the project, the model shortens the tenor and defaults to the remaining life of the project."]
[null,6,null,"Interest does not accrue during the construction period. Debt service begins in YR 1 of operations."]
[null,7,null,"Capex calculated in the investment year will always reflect dollars in the year that the construction cost and consumer price indices are set to. Indices must be updated annually. "]
[null,8,null,"Only yard waste is sent to composting without forced aeration. All organics are sent to composting with forced aeration. Yard waste bypasses the wet anaerobic digesters scenarios (both high tech and low tech), but can be introduced into the composting process, should the user elect to compost digestate or produce yard waste compost."]
[null,9,null,"Maintenance and insurance expenses are calculated as a percentage of capex prior to contingencies being added in."]
{"$rows_left_out":6}
{"sheet":"13-Sources","index":13,"n_rows":38,"n_cols":3,"rows_kept":38,"cut":false,"hidden":false,"merged":[[1,1,1,2]]}
[]
[null,"Sources"]
[]
[null,null,"Source"]
[null,1,"Angelonidi, Eleni and Stephen R. Smith. \"A Comparison of Wet and Dry Anaerobic Digestion Processes for the Treatment of Municipal Solid Waste and Food Waste.\" Water and Environment Journal 29, 2015, pp. 549-557."]
[null,{"$f":"B5+1","v":2},"Frost, Peter and Stephen Gilkinson. \"FIRST 18 MONTH PERFORMANCE SUMMARY FOR ANAEROBIC DIGESTION OF DAIRY COW SLURRY AT AFBI HILLSBOROUGH.\" Agri-Food and Biosciences Institute. August 2010. "]
[null,{"$f":"B6+1","v":3},"Bioferm Energy Systems. \"Anaerobic Digestion FAQ\". Bioferm Energy Systems. n.d. Accssed August 2014."]
[null,4,"Blair, Charlie. \"Energy from Waste Potential in Scotland.\" January 2010.  https://www.webarchive.org.uk/wayback/archive/3000/https://www.gov.scot/resource/doc/311011/0098129.pdf. Accessed December 2014."]
[null,5,"Chastain, John P. and James J. Camberato. \"Dairy Manure Production and Nutrient Content.\" Confined Animal Manure Manager Certification Program Manual: Dairy Version. 2004."]
[null,6,"Crowe, Matt, Kirsty Nolan, Caitríona Collins, Gerry Carty, Brian Donlon, Merete Kristoffersen, Morten Brøgger, Morten Carlsbæk, Reto Michael Hummelshøj, and Claus Dahl Thomsen (European Topic Centre on Waste). \"Biodegradable Municipal Waste\nManagement in Europe Part 3: Technology and Market Issues.\" January 2002. https://www.eea.europa.eu/publications/topic_report_2001_15_Part3. Accessed July 2014."]
[null,{"$f":"B10+1","v":7},"Endeco Spa. \"Anaerobic Processing Principles & Technologies.\" February 2017. https://www.endeco.it/wp/wp-content/uploads/2017/02/CatalogueAnaerobicDigestionPrinciples.pdf. Accessed June 2021."]
[null,{"$f":"B11+1","v":8},"Eunomia Research & Consulting. \"Annexes.\" Costs for Municipal Waste Management in the EU. European Commission, 2002. Web."]
[null,9,"Fachagentur Nachwachsende Rohstoffe (FNR). Biogas: An Introduction. 2013. https://www.fnr.de/fileadmin/Projekte/2021/Mediathek/brosch.biogas-2013-en-web-pdf.pdf."]
[null,10,"Goldstein, Nora. \"High Solids Anaerobic Digestion and Composting in San Jose.\" Biocycle Magazine, March/April 2014, https://www.biocycle.net/2014/03/28/high-solids-anaerobic-digestion-composting-in-san-jose/. Accessed October 2014."]
[null,11,"Italian Composting and Biogas Association. Biogas e Compost: da rifiuti organici selezionati. October 2011. https://www.compost.it/attachments/604_CIC_biogas_e_compost_2011_definitivo.pdf."]
{"$rows_left_out":23}